{"text_format":"1","workbook":"xlsx","n_sheets":9,"sheets":["Instructions","Points","Teams","Girls Results","Girls Totals","Boys Results","Boys Totals","Girls - Overall for papers","Boys - Overall for papers"],"not_rendered":{"charts":0,"images":1,"macros":1,"external_links":0,"defined_names":4,"comments":0,"pivot_tables":0},"unopened":[],"bounds":{"document_bytes":16777216,"sheet_cells":100000,"rows_first":2000,"rows_last":500,"rows_between":2000,"halvings":0,"cell_chars":16384,"cell_head_chars":4096},"cells_cut":0,"cells_raw":0,"read":"whole","date_system":"1900"}

{"sheet":"Instructions","index":0,"n_rows":29,"n_cols":2,"rows_kept":29,"cut":false,"hidden":false,"merged":[]}
[]
["1) ","This spreadsheet is fairly simple to use; please read all instructions and directions carefully, on this and every page, to clarify what you need to do and this will make using this tool easier.  There are 9 instructions/directions on this page.\n\nEven though you have not read it yet, Do Not Forget to Perform #9 when completely done.\n\nThe word \"Tab\" and \"Page\" are and will be used interchangeably in this spreadsheet.  You will find the Tabs near bottom of the page, i.e. this page has the Tab of \"Instructions\"."]
[]
["2) ","I would highly suggest that you first exit out of this spreadsheet and make a copy of this file.  Then after you have a copy, modify the file name to reflect the date of the meet where the file name has the \"(date)\" at the end of it.  Replace \"(date)\" with the meet date in the format mm-dd-yy, and keep the rest. This way you have a master file that is blank and you create a file for each meet.\n\nWhen you re-enter the spreadsheet it asks if you want to \"Enable Macros\", click on this button as you do want to have the macros in this spreadsheet enabled."]
[]
["3) ","You will perform the meet setup activities on the \"Points\" page and the \"Teams\" page.   You should not need to change them after that."]
[]
["4) ","Once the setup is done, ALL of your effort will be entering data for the Girls and for the Boys in either the \"Girls Results\" page or the \"Boys Results\" page.  Alternating between the two tabs as each events results come to you for compiling.  These 2 pages feed information/data to the other pages."]
{"$rows_left_out":22}
{"sheet":"Points","index":1,"n_rows":41,"n_cols":13,"rows_kept":41,"cut":false,"hidden":false,"merged":[]}
["# of Teams",null,"1st Place","2nd Place","3rd Place","4th Place","5th Place","6th Place","7th Place","8th Place"]
[]
[2]
["  Individual",null,5,3,1]
["  Relay",null,5]
[3]
["  Individual",null,5,3,2,1]
["  Relay",null,5,3]
{"$rows_left_out":34}
{"sheet":"Teams","index":2,"n_rows":32,"n_cols":15,"rows_kept":32,"cut":false,"hidden":false,"merged":[]}
[null,"Team Name"]
[null,"Brighton",null,null,null,null,null,null,null,null,null,"\n\n"]
[null,"Prairie View"]
[null,"Thornton"]
[null,"Westminster"]
[]
[null," "]
[null," "]
{"$rows_left_out":25}
{"sheet":"Girls Results","index":3,"n_rows":89,"n_cols":20,"rows_kept":89,"cut":false,"hidden":false,"merged":[[0,2,0,6],[1,2,1,6]]}
["Date",null,{"$f":"Points!C40","v":"2013-04-03"}]
["Meet",null,{"$f":"Points!C41","v":"EMAC JV meet"}]
[]
["Event",null,"1st Place",null,"2nd Place",null,"3rd Place",null,"4th Place",null,"5th Place",null,"6th Place",null,"7th Place",null,"8th Place"]
[]
["800 m Sprint Medley Relay"]
["   Team",null,"Thornton",null,"Brighton",null,"Prairie View",null,null,null,null,null,null,null,null,null,null,null,null,"Each Event is listed in column A.  Below each Event are the"]
["   Time",null,"2:12",null,"2:18",null,"2:20",null,null,null,null,null,null,null,null,null,null,null,null,"2 or 3 labeled rows (in red) of the Events' required results "]
{"$rows_left_out":82}
{"sheet":"Girls Totals","index":4,"n_rows":43,"n_cols":25,"rows_kept":43,"cut":false,"hidden":false,"merged":[[0,2,0,6],[1,2,1,6]]}
["Date",null,{"$f":"Points!C40","v":"2013-04-03"}]
["Meet",null,{"$f":"Points!C41","v":"EMAC JV meet"}]
[]
["Event",null,{"$f":"IF(Teams!$B2=\" \",\"OK\",Teams!$B2)","v":"Brighton"},null,{"$f":"IF(Teams!$B3=\" \",\"OK\",Teams!$B3)","v":"Prairie View"},null,{"$f":"IF(Teams!$B4=\" \",\"OK\",Teams!$B4)","v":"Thornton"},null,{"$f":"IF(Teams!$B5=\" \",\"OK\",Teams!$B5)","v":"Westminster"},null,{"$f":"IF(Teams!$B6=\" \",\"OK\",Teams!$B6)","v":0},null,{"$f":"IF(Teams!$B7=\" \",\"OK\",Teams!$B7)","v":"OK"},null,{"$f":"IF(Teams!$B8=\" \",\"OK\",Teams!$B8)","v":"OK"},null,{"$f":"IF(Teams!$B9=\" \",\"OK\",Teams!$B9)","v":"OK"},null,{"$f":"IF(Teams!$B10=\" \",\"OK\",Teams!$B10)","v":"OK"},null,null,"Total Pts Awarded","Total Pts Avail"]
[]
[{"$f":"'Girls Results'!A6","v":"800 m Sprint Medley Relay"},null,{"$f":"SUM(IF('Girls Results'!$C$7=C$4,Points!$C$31)+IF('Girls Results'!$E$7=C$4,Points!$D$31)+IF('Girls Results'!$G$7=C$4,Points!$E$31)+IF('Girls Results'!$I$7=C$4,Points!$F$31)+IF('Girls Results'!$K$7=C$4,Points!$G$31)+IF('Girls Results'!$M$7=C$4,Points!$H$31)+IF('Girls Results'!$O$7=C$4,Points!$I$31)+IF('Girls Results'!$Q$7=C$4,Points!$J$31)+0)","v":4},null,{"$f":"SUM(IF('Girls Results'!$C$7=E$4,Points!$C$31)+IF('Girls Results'!$E$7=E$4,Points!$D$31)+IF('Girls Results'!$G$7=E$4,Points!$E$31)+IF('Girls Results'!$I$7=E$4,Points!$F$31)+IF('Girls Results'!$K$7=E$4,Points!$G$31)+IF('Girls Results'!$M$7=E$4,Points!$H$31)+IF('Girls Results'!$O$7=E$4,Points!$I$31)+IF('Girls Results'!$Q$7=E$4,Points!$J$31)+0)","v":2},null,{"$f":"SUM(IF('Girls Results'!$C$7=G$4,Points!$C$31)+IF('Girls Results'!$E$7=G$4,Points!$D$31)+IF('Girls Results'!$G$7=G$4,Points!$E$31)+IF('Girls Results'!$I$7=G$4,Points!$F$31)+IF('Girls Results'!$K$7=G$4,Points!$G$31)+IF('Girls Results'!$M$7=G$4,Points!$H$31)+IF('Girls Results'!$O$7=G$4,Points!$I$31)+IF('Girls Results'!$Q$7=G$4,Points!$J$31)+0)","v":6},null,{"$f":"SUM(IF('Girls Results'!$C$7=I$4,Points!$C$31)+IF('Girls Results'!$E$7=I$4,Points!$D$31)+IF('Girls Results'!$G$7=I$4,Points!$E$31)+IF('Girls Results'!$I$7=I$4,Points!$F$31)+IF('Girls Results'!$K$7=I$4,Points!$G$31)+IF('Girls Results'!$M$7=I$4,Points!$H$31)+IF('Girls Results'!$O$7=I$4,Points!$I$31)+IF('Girls Results'!$Q$7=I$4,Points!$J$31)+0)","v":0},null,{"$f":"SUM(IF('Girls Results'!$C$7=K$4,Points!$C$31)+IF('Girls Results'!$E$7=K$4,Points!$D$31)+IF('Girls Results'!$G$7=K$4,Points!$E$31)+IF('Girls Results'!$I$7=K$4,Points!$F$31)+IF('Girls Results'!$K$7=K$4,Points!$G$31)+IF('Girls Results'!$M$7=K$4,Points!$H$31)+IF('Girls Results'!$O$7=K$4,Points!$I$31)+IF('Girls Results'!$Q$7=K$4,Points!$J$31)+0)","v":0},null,{"$f":"SUM(IF('Girls Results'!$C$7=M$4,Points!$C$31)+IF('Girls Results'!$E$7=M$4,Points!$D$31)+IF('Girls Results'!$G$7=M$4,Points!$E$31)+IF('Girls Results'!$I$7=M$4,Points!$F$31)+IF('Girls Results'!$K$7=M$4,Points!$G$31)+IF('Girls Results'!$M$7=M$4,Points!$H$31)+IF('Girls Results'!$O$7=M$4,Points!$I$31)+IF('Girls Results'!$Q$7=M$4,Points!$J$31)+0)","v":0},null,{"$f":"SUM(IF('Girls Results'!$C$7=O$4,Points!$C$31)+IF('Girls Results'!$E$7=O$4,Points!$D$31)+IF('Girls Results'!$G$7=O$4,Points!$E$31)+IF('Girls Results'!$I$7=O$4,Points!$F$31)+IF('Girls Results'!$K$7=O$4,Points!$G$31)+IF('Girls Results'!$M$7=O$4,Points!$H$31)+IF('Girls Results'!$O$7=O$4,Points!$I$31)+IF('Girls Results'!$Q$7=O$4,Points!$J$31)+0)","v":0},null,{"$f":"SUM(IF('Girls Results'!$C$7=Q$4,Points!$C$31)+IF('Girls Results'!$E$7=Q$4,Points!$D$31)+IF('Girls Results'!$G$7=Q$4,Points!$E$31)+IF('Girls Results'!$I$7=Q$4,Points!$F$31)+IF('Girls Results'!$K$7=Q$4,Points!$G$31)+IF('Girls Results'!$M$7=Q$4,Points!$H$31)+IF('Girls Results'!$O$7=Q$4,Points!$I$31)+IF('Girls Results'!$Q$7=Q$4,Points!$J$31)+0)","v":0},null,{"$f":"SUM(IF('Girls Results'!$C$7=S$4,Points!$C$31)+IF('Girls Results'!$E$7=S$4,Points!$D$31)+IF('Girls Results'!$G$7=S$4,Points!$E$31)+IF('Girls Results'!$I$7=S$4,Points!$F$31)+IF('Girls Results'!$K$7=S$4,Points!$G$31)+IF('Girls Results'!$M$7=S$4,Points!$H$31)+IF('Girls Results'!$O$7=S$4,Points!$I$31)+IF('Girls Results'!$Q$7=S$4,Points!$J$31)+0)","v":0},null,null,{"$f":"SUM(C6:S6)","v":12},{"$f":"Points!$L$31","v":12}]
[null,null,null,null,null,null,null,null,null,null,null,null,null,null,null,null,null,null,null,null,null,null,null,null,"You should not make any changes on "]
[{"$f":"'Girls Results'!A10","v":"4 X 800 m Relay"},null,{"$f":"SUM(IF('Girls Results'!$C$11=C$4,Points!$C$31)+IF('Girls Results'!$E$11=C$4,Points!$D$31)+IF('Girls Results'!$G$11=C$4,Points!$E$31)+IF('Girls Results'!$I$11=C$4,Points!$F$31)+IF('Girls Results'!$K$11=C$4,Points!$G$31)+IF('Girls Results'!$M$11=C$4,Points!$H$31)+IF('Girls Results'!$O$11=C$4,Points!$I$31)+IF('Girls Results'!$Q$11=C$4,Points!$J$31)+0)","v":6},null,{"$f":"SUM(IF('Girls Results'!$C$11=E$4,Points!$C$31)+IF('Girls Results'!$E$11=E$4,Points!$D$31)+IF('Girls Results'!$G$11=E$4,Points!$E$31)+IF('Girls Results'!$I$11=E$4,Points!$F$31)+IF('Girls Results'!$K$11=E$4,Points!$G$31)+IF('Girls Results'!$M$11=E$4,Points!$H$31)+IF('Girls Results'!$O$11=E$4,Points!$I$31)+IF('Girls Results'!$Q$11=E$4,Points!$J$31)+0)","v":0},null,{"$f":"SUM(IF('Girls Results'!$C$11=G$4,Points!$C$31)+IF('Girls Results'!$E$11=G$4,Points!$D$31)+IF('Girls Results'!$G$11=G$4,Points!$E$31)+IF('Girls Results'!$I$11=G$4,Points!$F$31)+IF('Girls Results'!$K$11=G$4,Points!$G$31)+IF('Girls Results'!$M$11=G$4,Points!$H$31)+IF('Girls Results'!$O$11=G$4,Points!$I$31)+IF('Girls Results'!$Q$11=G$4,Points!$J$31)+0)","v":0},null,{"$f":"SUM(IF('Girls Results'!$C$11=I$4,Points!$C$31)+IF('Girls Results'!$E$11=I$4,Points!$D$31)+IF('Girls Results'!$G$11=I$4,Points!$E$31)+IF('Girls Results'!$I$11=I$4,Points!$F$31)+IF('Girls Results'!$K$11=I$4,Points!$G$31)+IF('Girls Results'!$M$11=I$4,Points!$H$31)+IF('Girls Results'!$O$11=I$4,Points!$I$31)+IF('Girls Results'!$Q$11=I$4,Points!$J$31)+0)","v":0},null,{"$f":"SUM(IF('Girls Results'!$C$11=K$4,Points!$C$31)+IF('Girls Results'!$E$11=K$4,Points!$D$31)+IF('Girls Results'!$G$11=K$4,Points!$E$31)+IF('Girls Results'!$I$11=K$4,Points!$F$31)+IF('Girls Results'!$K$11=K$4,Points!$G$31)+IF('Girls Results'!$M$11=K$4,Points!$H$31)+IF('Girls Results'!$O$11=K$4,Points!$I$31)+IF('Girls Results'!$Q$11=K$4,Points!$J$31)+0)","v":6},null,{"$f":"SUM(IF('Girls Results'!$C$11=M$4,Points!$C$31)+IF('Girls Results'!$E$11=M$4,Points!$D$31)+IF('Girls Results'!$G$11=M$4,Points!$E$31)+IF('Girls Results'!$I$11=M$4,Points!$F$31)+IF('Girls Results'!$K$11=M$4,Points!$G$31)+IF('Girls Results'!$M$11=M$4,Points!$H$31)+IF('Girls Results'!$O$11=M$4,Points!$I$31)+IF('Girls Results'!$Q$11=M$4,Points!$J$31)+0)","v":0},null,{"$f":"SUM(IF('Girls Results'!$C$11=O$4,Points!$C$31)+IF('Girls Results'!$E$11=O$4,Points!$D$31)+IF('Girls Results'!$G$11=O$4,Points!$E$31)+IF('Girls Results'!$I$11=O$4,Points!$F$31)+IF('Girls Results'!$K$11=O$4,Points!$G$31)+IF('Girls Results'!$M$11=O$4,Points!$H$31)+IF('Girls Results'!$O$11=O$4,Points!$I$31)+IF('Girls Results'!$Q$11=O$4,Points!$J$31)+0)","v":0},null,{"$f":"SUM(IF('Girls Results'!$C$11=Q$4,Points!$C$31)+IF('Girls Results'!$E$11=Q$4,Points!$D$31)+IF('Girls Results'!$G$11=Q$4,Points!$E$31)+IF('Girls Results'!$I$11=Q$4,Points!$F$31)+IF('Girls Results'!$K$11=Q$4,Points!$G$31)+IF('Girls Results'!$M$11=Q$4,Points!$H$31)+IF('Girls Results'!$O$11=Q$4,Points!$I$31)+IF('Girls Results'!$Q$11=Q$4,Points!$J$31)+0)","v":0},null,{"$f":"SUM(IF('Girls Results'!$C$11=S$4,Points!$C$31)+IF('Girls Results'!$E$11=S$4,Points!$D$31)+IF('Girls Results'!$G$11=S$4,Points!$E$31)+IF('Girls Results'!$I$11=S$4,Points!$F$31)+IF('Girls Results'!$K$11=S$4,Points!$G$31)+IF('Girls Results'!$M$11=S$4,Points!$H$31)+IF('Girls Results'!$O$11=S$4,Points!$I$31)+IF('Girls Results'!$Q$11=S$4,Points!$J$31)+0)","v":0},null,null,{"$f":"SUM(C8:S8)","v":12},{"$f":"Points!$L$31","v":12},null,"this page.  "]
{"$rows_left_out":36}
{"sheet":"Boys Results","index":5,"n_rows":89,"n_cols":20,"rows_kept":89,"cut":false,"hidden":false,"merged":[[0,2,0,6],[1,2,1,6]]}
["Date",null,{"$f":"Points!C40","v":"2013-04-03"}]
["Meet",null,{"$f":"Points!C41","v":"EMAC JV meet"}]
[]
[]
[]
[]
[]
["Event",null,"1st Place",null,"2nd Place",null,"3rd Place",null,"4th Place",null,"5th Place",null,"6th Place",null,"7th Place",null,"8th Place"]
{"$rows_left_out":82}
{"sheet":"Boys Totals","index":6,"n_rows":41,"n_cols":23,"rows_kept":41,"cut":false,"hidden":false,"merged":[[0,2,0,6],[1,2,1,6]]}
["Date",null,{"$f":"Points!C40","v":"2013-04-03"}]
["Meet",null,{"$f":"Points!C41","v":"EMAC JV meet"}]
[]
["Event",null,{"$f":"IF(Teams!$B2=\" \",\"OK\",IF(Teams!$B2=Teams!$L$27,\"OK\",Teams!$B2))","v":"Brighton"},null,{"$f":"IF(Teams!$B3=\" \",\"OK\",IF(Teams!$B3=Teams!$L$27,\"OK\",Teams!$B3))","v":"Prairie View"},null,{"$f":"IF(Teams!$B4=\" \",\"OK\",IF(Teams!$B4=Teams!$L$27,\"OK\",Teams!$B4))","v":"Thornton"},null,{"$f":"IF(Teams!$B5=\" \",\"OK\",IF(Teams!$B5=Teams!$L$27,\"OK\",Teams!$B5))","v":"Westminster"},null,{"$f":"IF(Teams!$B6=\" \",\"OK\",IF(Teams!$B6=Teams!$L$27,\"OK\",Teams!$B6))","v":"OK"},null,{"$f":"IF(Teams!$B7=\" \",\"OK\",IF(Teams!$B7=Teams!$L$27,\"OK\",Teams!$B7))","v":"OK"},null,{"$f":"IF(Teams!$B8=\" \",\"OK\",IF(Teams!$B8=Teams!$L$27,\"OK\",Teams!$B8))","v":"OK"},null,{"$f":"IF(Teams!$B9=\" \",\"OK\",IF(Teams!$B9=Teams!$L$27,\"OK\",Teams!$B9))","v":"OK"},null,null,"Total Pts Awarded","Total Pts Avail"]
[]
[{"$f":"'Boys Results'!A10","v":"4 X 800 m Relay"},null,{"$f":"SUM(IF('Boys Results'!$C$11=C$4,Points!$C$36)+IF('Boys Results'!$E$11=C$4,Points!$D$36)+IF('Boys Results'!$G$11=C$4,Points!$E$36)+IF('Boys Results'!$I$11=C$4,Points!$F$36)+IF('Boys Results'!$K$11=C$4,Points!$G$36)+IF('Boys Results'!$M$11=C$4,Points!$H$36)+IF('Boys Results'!$O$11=C$4,Points!$I$36)+IF('Boys Results'!$Q$11=C$4,Points!$J$36)+0)","v":4},null,{"$f":"SUM(IF('Boys Results'!$C$11=E$4,Points!$C$36)+IF('Boys Results'!$E$11=E$4,Points!$D$36)+IF('Boys Results'!$G$11=E$4,Points!$E$36)+IF('Boys Results'!$I$11=E$4,Points!$F$36)+IF('Boys Results'!$K$11=E$4,Points!$G$36)+IF('Boys Results'!$M$11=E$4,Points!$H$36)+IF('Boys Results'!$O$11=E$4,Points!$I$36)+IF('Boys Results'!$Q$11=E$4,Points!$J$36)+0)","v":0},null,{"$f":"SUM(IF('Boys Results'!$C$11=G$4,Points!$C$36)+IF('Boys Results'!$E$11=G$4,Points!$D$36)+IF('Boys Results'!$G$11=G$4,Points!$E$36)+IF('Boys Results'!$I$11=G$4,Points!$F$36)+IF('Boys Results'!$K$11=G$4,Points!$G$36)+IF('Boys Results'!$M$11=G$4,Points!$H$36)+IF('Boys Results'!$O$11=G$4,Points!$I$36)+IF('Boys Results'!$Q$11=G$4,Points!$J$36)+0)","v":6},null,{"$f":"SUM(IF('Boys Results'!$C$11=I$4,Points!$C$36)+IF('Boys Results'!$E$11=I$4,Points!$D$36)+IF('Boys Results'!$G$11=I$4,Points!$E$36)+IF('Boys Results'!$I$11=I$4,Points!$F$36)+IF('Boys Results'!$K$11=I$4,Points!$G$36)+IF('Boys Results'!$M$11=I$4,Points!$H$36)+IF('Boys Results'!$O$11=I$4,Points!$I$36)+IF('Boys Results'!$Q$11=I$4,Points!$J$36)+0)","v":0},null,{"$f":"SUM(IF('Boys Results'!$C$11=K$4,Points!$C$36)+IF('Boys Results'!$E$11=K$4,Points!$D$36)+IF('Boys Results'!$G$11=K$4,Points!$E$36)+IF('Boys Results'!$I$11=K$4,Points!$F$36)+IF('Boys Results'!$K$11=K$4,Points!$G$36)+IF('Boys Results'!$M$11=K$4,Points!$H$36)+IF('Boys Results'!$O$11=K$4,Points!$I$36)+IF('Boys Results'!$Q$11=K$4,Points!$J$36)+0)","v":0},null,{"$f":"SUM(IF('Boys Results'!$C$11=M$4,Points!$C$36)+IF('Boys Results'!$E$11=M$4,Points!$D$36)+IF('Boys Results'!$G$11=M$4,Points!$E$36)+IF('Boys Results'!$I$11=M$4,Points!$F$36)+IF('Boys Results'!$K$11=M$4,Points!$G$36)+IF('Boys Results'!$M$11=M$4,Points!$H$36)+IF('Boys Results'!$O$11=M$4,Points!$I$36)+IF('Boys Results'!$Q$11=M$4,Points!$J$36)+0)","v":0},null,{"$f":"SUM(IF('Boys Results'!$C$11=O$4,Points!$C$36)+IF('Boys Results'!$E$11=O$4,Points!$D$36)+IF('Boys Results'!$G$11=O$4,Points!$E$36)+IF('Boys Results'!$I$11=O$4,Points!$F$36)+IF('Boys Results'!$K$11=O$4,Points!$G$36)+IF('Boys Results'!$M$11=O$4,Points!$H$36)+IF('Boys Results'!$O$11=O$4,Points!$I$36)+IF('Boys Results'!$Q$11=O$4,Points!$J$36)+0)","v":0},null,{"$f":"SUM(IF('Boys Results'!$C$11=Q$4,Points!$C$36)+IF('Boys Results'!$E$11=Q$4,Points!$D$36)+IF('Boys Results'!$G$11=Q$4,Points!$E$36)+IF('Boys Results'!$I$11=Q$4,Points!$F$36)+IF('Boys Results'!$K$11=Q$4,Points!$G$36)+IF('Boys Results'!$M$11=Q$4,Points!$H$36)+IF('Boys Results'!$O$11=Q$4,Points!$I$36)+IF('Boys Results'!$Q$11=Q$4,Points!$J$36)+0)","v":0},null,null,{"$f":"SUM(C6:R6)","v":10},{"$f":"Points!$L$36","v":12}]
[null,null,null,null,null,null,null,null,null,null,null,null,null,null,null,null,null,null,null,null,null,null,"You should not make any changes"]
[{"$f":"'Boys Results'!A14","v":"110 m H Hurdles"},null,{"$f":"SUM(IF('Boys Results'!$C$16=C$4,Points!$C$35)+IF('Boys Results'!$E$16=C$4,Points!$D$35)+IF('Boys Results'!$G$16=C$4,Points!$E$35)+IF('Boys Results'!$I$16=C$4,Points!$F$35)+IF('Boys Results'!$K$16=C$4,Points!$G$35)+IF('Boys Results'!$M$16=C$4,Points!$H$35)+IF('Boys Results'!$O$16=C$4,Points!$I$35)+IF('Boys Results'!$Q$16=C$4,Points!$J$35)+0)","v":0},null,{"$f":"SUM(IF('Boys Results'!$C$16=E$4,Points!$C$35)+IF('Boys Results'!$E$16=E$4,Points!$D$35)+IF('Boys Results'!$G$16=E$4,Points!$E$35)+IF('Boys Results'!$I$16=E$4,Points!$F$35)+IF('Boys Results'!$K$16=E$4,Points!$G$35)+IF('Boys Results'!$M$16=E$4,Points!$H$35)+IF('Boys Results'!$O$16=E$4,Points!$I$35)+IF('Boys Results'!$Q$16=E$4,Points!$J$35)+0)","v":4},null,{"$f":"SUM(IF('Boys Results'!$C$16=G$4,Points!$C$35)+IF('Boys Results'!$E$16=G$4,Points!$D$35)+IF('Boys Results'!$G$16=G$4,Points!$E$35)+IF('Boys Results'!$I$16=G$4,Points!$F$35)+IF('Boys Results'!$K$16=G$4,Points!$G$35)+IF('Boys Results'!$M$16=G$4,Points!$H$35)+IF('Boys Results'!$O$16=G$4,Points!$I$35)+IF('Boys Results'!$Q$16=G$4,Points!$J$35)+0)","v":0},null,{"$f":"SUM(IF('Boys Results'!$C$16=I$4,Points!$C$35)+IF('Boys Results'!$E$16=I$4,Points!$D$35)+IF('Boys Results'!$G$16=I$4,Points!$E$35)+IF('Boys Results'!$I$16=I$4,Points!$F$35)+IF('Boys Results'!$K$16=I$4,Points!$G$35)+IF('Boys Results'!$M$16=I$4,Points!$H$35)+IF('Boys Results'!$O$16=I$4,Points!$I$35)+IF('Boys Results'!$Q$16=I$4,Points!$J$35)+0)","v":11},null,{"$f":"SUM(IF('Boys Results'!$C$16=K$4,Points!$C$35)+IF('Boys Results'!$E$16=K$4,Points!$D$35)+IF('Boys Results'!$G$16=K$4,Points!$E$35)+IF('Boys Results'!$I$16=K$4,Points!$F$35)+IF('Boys Results'!$K$16=K$4,Points!$G$35)+IF('Boys Results'!$M$16=K$4,Points!$H$35)+IF('Boys Results'!$O$16=K$4,Points!$I$35)+IF('Boys Results'!$Q$16=K$4,Points!$J$35)+0)","v":0},null,{"$f":"SUM(IF('Boys Results'!$C$16=M$4,Points!$C$35)+IF('Boys Results'!$E$16=M$4,Points!$D$35)+IF('Boys Results'!$G$16=M$4,Points!$E$35)+IF('Boys Results'!$I$16=M$4,Points!$F$35)+IF('Boys Results'!$K$16=M$4,Points!$G$35)+IF('Boys Results'!$M$16=M$4,Points!$H$35)+IF('Boys Results'!$O$16=M$4,Points!$I$35)+IF('Boys Results'!$Q$16=M$4,Points!$J$35)+0)","v":0},null,{"$f":"SUM(IF('Boys Results'!$C$16=O$4,Points!$C$35)+IF('Boys Results'!$E$16=O$4,Points!$D$35)+IF('Boys Results'!$G$16=O$4,Points!$E$35)+IF('Boys Results'!$I$16=O$4,Points!$F$35)+IF('Boys Results'!$K$16=O$4,Points!$G$35)+IF('Boys Results'!$M$16=O$4,Points!$H$35)+IF('Boys Results'!$O$16=O$4,Points!$I$35)+IF('Boys Results'!$Q$16=O$4,Points!$J$35)+0)","v":0},null,{"$f":"SUM(IF('Boys Results'!$C$16=Q$4,Points!$C$35)+IF('Boys Results'!$E$16=Q$4,Points!$D$35)+IF('Boys Results'!$G$16=Q$4,Points!$E$35)+IF('Boys Results'!$I$16=Q$4,Points!$F$35)+IF('Boys Results'!$K$16=Q$4,Points!$G$35)+IF('Boys Results'!$M$16=Q$4,Points!$H$35)+IF('Boys Results'!$O$16=Q$4,Points!$I$35)+IF('Boys Results'!$Q$16=Q$4,Points!$J$35)+0)","v":0},null,null,{"$f":"SUM(C8:R8)","v":15},{"$f":"Points!$L$35","v":16},null,"on this page."]
{"$rows_left_out":34}
{"sheet":"Girls - Overall for papers","index":7,"n_rows":93,"n_cols":13,"rows_kept":93,"cut":false,"hidden":false,"merged":[[0,0,0,10],[1,0,1,10],[3,0,3,10]]}
["Girls - EMAC JV Meet"]
["Hosted by Prairie View "]
[]
[{"$f":"Points!C40","v":"2013-04-03"}]
[]
["Team",null,"Pts",null,"Event",null,"1st Place",null,"2nd Place",null,"3rd Place",null,"4th Place"]
[]
[{"$f":"Teams!B3","v":"Prairie View"},null,{"$f":"'Girls Totals'!E43","v":71},null,{"$f":"'Girls Results'!A6","v":"800 m Sprint Medley Relay"}]
{"$rows_left_out":86}
{"sheet":"Boys - Overall for papers","index":8,"n_rows":89,"n_cols":13,"rows_kept":89,"cut":false,"hidden":false,"merged":[[0,0,0,10],[1,0,1,10],[3,0,3,10]]}
["Boys - EMAC JV Meet"]
["Hosted by Prairie View"]
[]
[{"$f":"Points!C40","v":"2013-04-03"}]
[]
["Team",null,"Pts",null,"Event",null,"1st Place",null,"2nd Place",null,"3rd Place",null,"4th Place"]
[]
[{"$f":"Teams!B3","v":"Prairie View"},null,{"$f":"'Boys Totals'!E41","v":88},null,{"$f":"'Boys Results'!A10","v":"4 X 800 m Relay"}]
{"$rows_left_out":81}